{"text_format":"1","workbook":"xlsx","n_sheets":12,"sheets":["Parámetros","Factores","Factor 1","Factor 2","Factor 3","Factor 4","Factor 5","Factor 6","Factor 7","Factor 8","Factor 9","Resultados"],"not_rendered":{"charts":0,"images":1,"macros":1,"external_links":0,"defined_names":2,"comments":1,"pivot_tables":0},"unopened":[],"bounds":{"document_bytes":16777216,"sheet_cells":100000,"rows_first":2000,"rows_last":500,"rows_between":2000,"halvings":0,"cell_chars":16384,"cell_head_chars":4096},"cells_cut":0,"cells_raw":0,"read":"whole","date_system":"1900"}

{"sheet":"Parámetros","index":0,"n_rows":35,"n_cols":4,"rows_kept":35,"cut":false,"hidden":false,"merged":[]}
["Parámetros para el Proceso de Jerarquización Analítica"]
["Creado por: Prof. Marco Arias Vargas (marco.ariasvargas@ucr.ac.cr)"]
[]
[]
["Factores por evaluar:"]
["Factor 1"]
["Factor 2"]
["Factor 3"]
["Factor 4"]
["Factor 5"]
["Factor 6"]
["Factor 7"]
["Factor 8"]
["Factor 9"]
[]
[]
["Alternativas a considerar:"]
["A"]
["B"]
["C"]
["D"]
["E"]
["F"]
[]
[]
["Índices aleatorios y porcentajes para inconsistencias, según el tamaño de la tabla:","n","IA","% Inc"]
[null,1,0,0.05]
[null,2,0,0.05]
[null,3,0.52,0.05]
[null,4,0.89,0.09]
[null,5,1.1100000000000001,0.1]
[null,6,1.25,0.1]
[null,7,1.35,0.1]
[null,8,1.4,0.1]
[null,9,1.45,0.1]

{"sheet":"Factores","index":1,"n_rows":50,"n_cols":11,"rows_kept":50,"cut":false,"hidden":false,"merged":[]}
["Matriz de pesos de factores:"]
[]
[]
[null,{"$f":"A5","v":"Factor 1"},{"$f":"A6","v":"Factor 2"},{"$f":"A7","v":"Factor 3"},{"$f":"A8","v":"Factor 4"},{"$f":"A9","v":"Factor 5"},{"$f":"A10","v":"Factor 6"},{"$f":"A11","v":"Factor 7"},{"$f":"A12","v":"Factor 8"},{"$f":"A13","v":"Factor 9"}]
[{"$f":"IF((Parámetros!A6)=\"\",\"\",(Parámetros!A6))","v":"Factor 1"},1,null,null,null,null,null,null,null,null,{"$f":"SUM(B5:J5)","v":1}]
[{"$f":"IF((Parámetros!A7)=\"\",\"\",(Parámetros!A7))","v":"Factor 2"},{"$f":"IF(LEFT($A6,11)=\"No utilizar\",\"\",(1/C5))","v":{"$error":"#DIV/0!"}},1,null,null,null,null,null,null,null,{"$error":"#DIV/0!"}]
[{"$f":"IF((Parámetros!A8)=\"\",\"\",(Parámetros!A8))","v":"Factor 3"},{"$f":"IF(LEFT($A7,11)=\"No utilizar\",\"\",(1/D5))","v":{"$error":"#DIV/0!"}},{"$f":"IF(LEFT($A7,11)=\"No utilizar\",\"\",(1/D6))","v":{"$error":"#DIV/0!"}},1,null,null,null,null,null,null,{"$error":"#DIV/0!"}]
[{"$f":"IF((Parámetros!A9)=\"\",\"\",(Parámetros!A9))","v":"Factor 4"},{"$f":"IF(LEFT($A8,11)=\"No utilizar\",\"\",(1/E5))","v":{"$error":"#DIV/0!"}},{"$f":"IF(LEFT($A8,11)=\"No utilizar\",\"\",(1/E6))","v":{"$error":"#DIV/0!"}},{"$f":"IF(LEFT($A8,11)=\"No utilizar\",\"\",(1/E7))","v":{"$error":"#DIV/0!"}},1,null,null,null,null,null,{"$error":"#DIV/0!"}]
[{"$f":"IF((Parámetros!A10)=\"\",\"\",(Parámetros!A10))","v":"Factor 5"},{"$f":"IF(LEFT($A9,11)=\"No utilizar\",\"\",(1/F5))","v":{"$error":"#DIV/0!"}},{"$f":"IF(LEFT($A9,11)=\"No utilizar\",\"\",(1/F6))","v":{"$error":"#DIV/0!"}},{"$f":"IF(LEFT($A9,11)=\"No utilizar\",\"\",(1/F7))","v":{"$error":"#DIV/0!"}},{"$f":"IF(LEFT($A9,11)=\"No utilizar\",\"\",(1/F8))","v":{"$error":"#DIV/0!"}},1,null,null,null,null,{"$error":"#DIV/0!"}]
[{"$f":"IF((Parámetros!A11)=\"\",\"\",(Parámetros!A11))","v":"Factor 6"},{"$f":"IF(LEFT($A10,11)=\"No utilizar\",\"\",(1/G5))","v":{"$error":"#DIV/0!"}},{"$f":"IF(LEFT($A10,11)=\"No utilizar\",\"\",(1/G6))","v":{"$error":"#DIV/0!"}},{"$f":"IF(LEFT($A10,11)=\"No utilizar\",\"\",(1/G7))","v":{"$error":"#DIV/0!"}},{"$f":"IF(LEFT($A10,11)=\"No utilizar\",\"\",(1/G8))","v":{"$error":"#DIV/0!"}},{"$f":"IF(LEFT($A10,11)=\"No utilizar\",\"\",(1/G9))","v":{"$error":"#DIV/0!"}},1,null,null,null,{"$error":"#DIV/0!"}]
[{"$f":"IF((Parámetros!A12)=\"\",\"\",(Parámetros!A12))","v":"Factor 7"},{"$f":"IF(LEFT($A11,11)=\"No utilizar\",\"\",(1/H5))","v":{"$error":"#DIV/0!"}},{"$f":"IF(LEFT($A11,11)=\"No utilizar\",\"\",(1/H6))","v":{"$error":"#DIV/0!"}},{"$f":"IF(LEFT($A11,11)=\"No utilizar\",\"\",(1/H7))","v":{"$error":"#DIV/0!"}},{"$f":"IF(LEFT($A11,11)=\"No utilizar\",\"\",(1/H8))","v":{"$error":"#DIV/0!"}},{"$f":"IF(LEFT($A11,11)=\"No utilizar\",\"\",(1/H9))","v":{"$error":"#DIV/0!"}},{"$f":"IF(LEFT($A11,11)=\"No utilizar\",\"\",(1/H10))","v":{"$error":"#DIV/0!"}},1,null,null,{"$error":"#DIV/0!"}]
[{"$f":"IF((Parámetros!A13)=\"\",\"\",(Parámetros!A13))","v":"Factor 8"},{"$f":"IF(LEFT($A12,11)=\"No utilizar\",\"\",(1/I5))","v":{"$error":"#DIV/0!"}},{"$f":"IF(LEFT($A12,11)=\"No utilizar\",\"\",(1/I6))","v":{"$error":"#DIV/0!"}},{"$f":"IF(LEFT($A12,11)=\"No utilizar\",\"\",(1/I7))","v":{"$error":"#DIV/0!"}},{"$f":"IF(LEFT($A12,11)=\"No utilizar\",\"\",(1/I8))","v":{"$error":"#DIV/0!"}},{"$f":"IF(LEFT($A12,11)=\"No utilizar\",\"\",(1/I9))","v":{"$error":"#DIV/0!"}},{"$f":"IF(LEFT($A12,11)=\"No utilizar\",\"\",(1/I10))","v":{"$error":"#DIV/0!"}},{"$f":"IF(LEFT($A12,11)=\"No utilizar\",\"\",(1/I11))","v":{"$error":"#DIV/0!"}},1,null,{"$error":"#DIV/0!"}]
[{"$f":"IF((Parámetros!A14)=\"\",\"\",(Parámetros!A14))","v":"Factor 9"},{"$f":"IF(LEFT($A13,11)=\"No utilizar\",\"\",(1/J5))","v":{"$error":"#DIV/0!"}},{"$f":"IF(LEFT($A13,11)=\"No utilizar\",\"\",(1/J6))","v":{"$error":"#DIV/0!"}},{"$f":"IF(LEFT($A13,11)=\"No utilizar\",\"\",(1/J7))","v":{"$error":"#DIV/0!"}},{"$f":"IF(LEFT($A13,11)=\"No utilizar\",\"\",(1/J8))","v":{"$error":"#DIV/0!"}},{"$f":"IF(LEFT($A13,11)=\"No utilizar\",\"\",(1/J9))","v":{"$error":"#DIV/0!"}},{"$f":"IF(LEFT($A13,11)=\"No utilizar\",\"\",(1/J10))","v":{"$error":"#DIV/0!"}},{"$f":"IF(LEFT($A13,11)=\"No utilizar\",\"\",(1/J11))","v":{"$error":"#DIV/0!"}},{"$f":"IF(LEFT($A13,11)=\"No utilizar\",\"\",(1/J12))","v":{"$error":"#DIV/0!"}},1,{"$error":"#DIV/0!"}]
["SUMATORIA:",{"$f":"SUM(B5:B13)","v":{"$error":"#DIV/0!"}},{"$f":"SUM(C5:C13)","v":{"$error":"#DIV/0!"}},{"$error":"#DIV/0!"},{"$error":"#DIV/0!"},{"$error":"#DIV/0!"},{"$error":"#DIV/0!"},{"$error":"#DIV/0!"},{"$error":"#DIV/0!"},1,{"$error":"#DIV/0!"}]
[]
[]
[]
[]
[null,{"$f":"B4","v":"Factor 1"},{"$f":"C4","v":"Factor 2"},"Factor 3","Factor 4","Factor 5","Factor 6","Factor 7","Factor 8","Factor 9","PESOS POR RENGLON"]
[{"$f":"A5","v":"Factor 1"},{"$f":"IFERROR((B5/$B$14),\"\")","v":""},{"$f":"IFERROR((C5/C$14),\"\")","v":""},{"$f":"IFERROR((D5/D$14),\"\")","v":""},"","","","","",0,{"$f":"IF((AVERAGEIF(B20:J20,\">0\"))=1,0,(AVERAGEIF(B20:J20,\">0\")))","v":{"$error":"#DIV/0!"}}]
[{"$f":"A6","v":"Factor 2"},{"$f":"IFERROR((B6/$B$14),\"\")","v":""},{"$f":"IFERROR((C6/C$14),\"\")","v":""},{"$f":"IFERROR((D6/D$14),\"\")","v":""},"","","","","",0,{"$f":"IF((AVERAGEIF(B21:J21,\">0\"))=1,0,(AVERAGEIF(B21:J21,\">0\")))","v":{"$error":"#DIV/0!"}}]
["Factor 3","",{"$f":"IFERROR((C7/C$14),\"\")","v":""},"","","","","","",0,{"$error":"#DIV/0!"}]
["Factor 4","","","","","","","","",0,{"$error":"#DIV/0!"}]
["Factor 5","","","","","","","","",0,{"$error":"#DIV/0!"}]
["Factor 6","","","","","","","","",0,{"$error":"#DIV/0!"}]
["Factor 7","","","","","","","","",0,{"$error":"#DIV/0!"}]
["Factor 8","","","","","","","","",0,{"$error":"#DIV/0!"}]
["Factor 9","","","","","","","","",1,0]
[null,{"$f":"SUM(B20:B28)","v":0},{"$f":"SUM(C20:C28)","v":0},0,0,0,0,0,0,1]
[]
[]
["Prueba de consistencia"]
["Multiplicación de matrices"]
[]
[{"$f":"A20","v":"Factor 1"},{"$f":"IFERROR(((B5*$K$20)+(C5*$K$21)+(D5*$K$22)+(E5*$K$23)+(F5*$K$24)+(G5*$K$25)+(H5*$K$26)+(I5*$K$27)+(J5*$K$28)),\"\")","v":""},{"$f":"IFERROR((B35/K20),\"\")","v":""}]
[{"$f":"A21","v":"Factor 2"},{"$f":"IFERROR(((B6*$K$20)+(C6*$K$21)+(D6*$K$22)+(E6*$K$23)+(F6*$K$24)+(G6*$K$25)+(H6*$K$26)+(I6*$K$27)+(J6*$K$28)),\"\")","v":""},{"$f":"IFERROR((B36/K21),\"\")","v":""}]
["Factor 3","",""]
["Factor 4","",""]
["Factor 5","",""]
["Factor 6","",""]
["Factor 7","",""]
["Factor 8","",""]
["Factor 9","",""]
[null,null,{"$f":"SUM(C35:C43)","v":0}]
[]
["n:",{"$f":"COUNTA(Parámetros!A6:A14)","v":9}]
["FACTOR:",{"$f":"(1/COUNT(C35:C43))*C44","v":{"$error":"#DIV/0!"}}]
["INDICE DE CONS:",{"$f":"(B47-COUNT(C35:C43))/((COUNT(C35:C43)-1))","v":{"$error":"#DIV/0!"}}]
["IA (nxn):",{"$f":"VLOOKUP(B46,Parámetros!B27:C35,2,0)","v":1.45}]
["CONSISTENCIA:",{"$f":"IF((B49*(VLOOKUP(B46,Parámetros!B27:D35,3,0)))<B48,\"Inconsistencias serias\",\"Grado de consistencia satisfactorio\")","v":{"$error":"#DIV/0!"}}]

{"sheet":"Factor 1","index":2,"n_rows":40,"n_cols":8,"rows_kept":40,"cut":false,"hidden":false,"merged":[]}
[{"$f":"Factores!A5","v":"Factor 1"}]
[]
[]
[]
[]
[null,{"$f":"A7","v":"A"},{"$f":"IF(A8=\"\",\"\",A8)","v":"B"},{"$f":"IF(A9=\"\",\"\",A9)","v":"C"},{"$f":"IF(A10=\"\",\"\",A10)","v":"D"},{"$f":"IF(A11=\"\",\"\",A11)","v":"E"},{"$f":"IF(A12=\"\",\"\",A12)","v":"F"}]
[{"$f":"IF((Parámetros!A18)=\"\",\"\",(Parámetros!A18))","v":"A"},1]
[{"$f":"IF((Parámetros!A19)=\"\",\"\",(Parámetros!A19))","v":"B"},{"$f":"IF($A8=\"\",\"\",(1/C7))","v":{"$error":"#DIV/0!"}},1]
[{"$f":"IF((Parámetros!A20)=\"\",\"\",(Parámetros!A20))","v":"C"},{"$f":"IF($A9=\"\",\"\",(1/D7))","v":{"$error":"#DIV/0!"}},{"$f":"IF($A9=\"\",\"\",(1/D8))","v":{"$error":"#DIV/0!"}},1]
[{"$f":"IF((Parámetros!A21)=\"\",\"\",(Parámetros!A21))","v":"D"},{"$f":"IF($A10=\"\",\"\",(1/E7))","v":{"$error":"#DIV/0!"}},{"$f":"IF($A10=\"\",\"\",(1/E8))","v":{"$error":"#DIV/0!"}},{"$f":"IF($A10=\"\",\"\",(1/E9))","v":{"$error":"#DIV/0!"}},1]
[{"$f":"IF((Parámetros!A22)=\"\",\"\",(Parámetros!A22))","v":"E"},{"$f":"IF($A11=\"\",\"\",(1/F7))","v":{"$error":"#DIV/0!"}},{"$f":"IF($A11=\"\",\"\",(1/F8))","v":{"$error":"#DIV/0!"}},{"$f":"IF($A11=\"\",\"\",(1/F9))","v":{"$error":"#DIV/0!"}},{"$f":"IF($A11=\"\",\"\",(1/F10))","v":{"$error":"#DIV/0!"}},1]
[{"$f":"IF((Parámetros!A23)=\"\",\"\",(Parámetros!A23))","v":"F"},{"$f":"IF($A12=\"\",\"\",(1/G7))","v":{"$error":"#DIV/0!"}},{"$f":"IF($A12=\"\",\"\",(1/G8))","v":{"$error":"#DIV/0!"}},{"$f":"IF($A12=\"\",\"\",(1/G9))","v":{"$error":"#DIV/0!"}},{"$f":"IF($A12=\"\",\"\",(1/G10))","v":{"$error":"#DIV/0!"}},{"$f":"IF($A12=\"\",\"\",(1/G11))","v":{"$error":"#DIV/0!"}},1]
[null,{"$f":"SUM(B7:B12)","v":{"$error":"#DIV/0!"}},{"$error":"#DIV/0!"},{"$error":"#DIV/0!"},{"$error":"#DIV/0!"},{"$error":"#DIV/0!"},1]
[]
[]
[null,{"$f":"B6","v":"A"},"B","C","D","E","F"]
[{"$f":"A7","v":"A"},{"$f":"IFERROR((B7/B$13),\"\")","v":""},{"$f":"IFERROR((C7/C$13),\"\")","v":""},"","","",0,{"$f":"IFERROR((IF((AVERAGEIF(B17:G17,\">0\"))=1,0,(AVERAGEIF(B17:G17,\">0\")))),0)","v":0}]
[{"$f":"IF(A8=\"\",\"\",A8)","v":"B"},{"$f":"IFERROR((B8/B$13),\"\")","v":""},"","","","",0,{"$f":"IFERROR((IF((AVERAGEIF(B18:G18,\">0\"))=1,0,(AVERAGEIF(B18:G18,\">0\")))),0)","v":0}]
[{"$f":"IF(A9=\"\",\"\",A9)","v":"C"},"","","","","",0,0]
[{"$f":"IF(A10=\"\",\"\",A10)","v":"D"},"","","","","",0,0]
[{"$f":"IF(A11=\"\",\"\",A11)","v":"E"},"","","","","",0,0]
[{"$f":"IF(A12=\"\",\"\",A12)","v":"F"},"","","","","",1,0]
[null,{"$f":"SUM(B17:B22)","v":0},0,0,0,0,1]
[]
[]
["Prueba de consistencia"]
[]
[{"$f":"A17","v":"A"},{"$f":"IFERROR(((B7*$H$17)+(C7*$H$18)+(D7*$H$19)+(E7*$H$20)+(F7*$H$21)+(G7*$H$22)),\"\")","v":0},{"$f":"IFERROR((B28/H17),\"\")","v":""}]
[{"$f":"IF(A8=\"\",\"\",A8)","v":"B"},{"$f":"IFERROR(((B8*$H$17)+(C8*$H$18)+(D8*$H$19)+(E8*$H$20)+(F8*$H$21)+(G8*$H$22)),\"\")","v":""},""]
[{"$f":"IF(A9=\"\",\"\",A9)","v":"C"},"",""]
[{"$f":"IF(A10=\"\",\"\",A10)","v":"D"},"",""]
[{"$f":"IF(A11=\"\",\"\",A11)","v":"E"},"",""]
[{"$f":"IF(A12=\"\",\"\",A12)","v":"F"},"",""]
[null,null,{"$f":"SUM(C28:C33)","v":0}]
[]
["n:",{"$f":"COUNTA(Parámetros!A18:A23)","v":6}]
["FACTOR:",{"$f":"(1/COUNT(C28:C33))*C34","v":{"$error":"#DIV/0!"}}]
["INDICE DE CONS:",{"$f":"(B37-COUNT(C28:C33))/(COUNT(C28:C33)-1)","v":{"$error":"#DIV/0!"}}]
["IA (nxn):",{"$f":"VLOOKUP(B36,Parámetros!B27:C35,2,0)","v":1.25}]
["CONSISTENCIA:",{"$f":"IF((B39*(VLOOKUP(B36,Parámetros!B27:D35,3,0)))<B38,\"Inconsistencias serias\",\"Grado de consistencia satisfactorio\")","v":{"$error":"#DIV/0!"}}]

{"sheet":"Factor 2","index":3,"n_rows":40,"n_cols":8,"rows_kept":40,"cut":false,"hidden":false,"merged":[]}
[{"$f":"Factores!A6","v":"Factor 2"}]
[]
[]
[]
[]
[null,{"$f":"A7","v":"A"},{"$f":"IF(A8=\"\",\"\",A8)","v":"B"},{"$f":"IF(A9=\"\",\"\",A9)","v":"C"},{"$f":"IF(A10=\"\",\"\",A10)","v":"D"},{"$f":"IF(A11=\"\",\"\",A11)","v":"E"},{"$f":"IF(A12=\"\",\"\",A12)","v":"F"}]
[{"$f":"IF((Parámetros!A18)=\"\",\"\",(Parámetros!A18))","v":"A"},1]
[{"$f":"IF((Parámetros!A19)=\"\",\"\",(Parámetros!A19))","v":"B"},{"$f":"IF($A8=\"\",\"\",(1/C7))","v":{"$error":"#DIV/0!"}},1]
[{"$f":"IF((Parámetros!A20)=\"\",\"\",(Parámetros!A20))","v":"C"},{"$f":"IF($A9=\"\",\"\",(1/D7))","v":{"$error":"#DIV/0!"}},{"$f":"IF($A9=\"\",\"\",(1/D8))","v":{"$error":"#DIV/0!"}},1]
[{"$f":"IF((Parámetros!A21)=\"\",\"\",(Parámetros!A21))","v":"D"},{"$f":"IF($A10=\"\",\"\",(1/E7))","v":{"$error":"#DIV/0!"}},{"$f":"IF($A10=\"\",\"\",(1/E8))","v":{"$error":"#DIV/0!"}},{"$f":"IF($A10=\"\",\"\",(1/E9))","v":{"$error":"#DIV/0!"}},1]
[{"$f":"IF((Parámetros!A22)=\"\",\"\",(Parámetros!A22))","v":"E"},{"$f":"IF($A11=\"\",\"\",(1/F7))","v":{"$error":"#DIV/0!"}},{"$f":"IF($A11=\"\",\"\",(1/F8))","v":{"$error":"#DIV/0!"}},{"$f":"IF($A11=\"\",\"\",(1/F9))","v":{"$error":"#DIV/0!"}},{"$f":"IF($A11=\"\",\"\",(1/F10))","v":{"$error":"#DIV/0!"}},1]
[{"$f":"IF((Parámetros!A23)=\"\",\"\",(Parámetros!A23))","v":"F"},{"$f":"IF($A12=\"\",\"\",(1/G7))","v":{"$error":"#DIV/0!"}},{"$f":"IF($A12=\"\",\"\",(1/G8))","v":{"$error":"#DIV/0!"}},{"$f":"IF($A12=\"\",\"\",(1/G9))","v":{"$error":"#DIV/0!"}},{"$f":"IF($A12=\"\",\"\",(1/G10))","v":{"$error":"#DIV/0!"}},{"$f":"IF($A12=\"\",\"\",(1/G11))","v":{"$error":"#DIV/0!"}},1]
[null,{"$f":"SUM(B7:B12)","v":{"$error":"#DIV/0!"}},{"$error":"#DIV/0!"},{"$error":"#DIV/0!"},{"$error":"#DIV/0!"},{"$error":"#DIV/0!"},1]
[]
[]
[null,{"$f":"B6","v":"A"},"B","C","D","E","F"]
[{"$f":"A7","v":"A"},{"$f":"IFERROR((B7/B$13),\"\")","v":""},{"$f":"IFERROR((C7/C$13),\"\")","v":""},"","","",0,{"$f":"IFERROR((IF((AVERAGEIF(B17:G17,\">0\"))=1,0,(AVERAGEIF(B17:G17,\">0\")))),0)","v":0}]
[{"$f":"IF(A8=\"\",\"\",A8)","v":"B"},{"$f":"IFERROR((B8/B$13),\"\")","v":""},"","","","",0,{"$f":"IFERROR((IF((AVERAGEIF(B18:G18,\">0\"))=1,0,(AVERAGEIF(B18:G18,\">0\")))),0)","v":0}]
[{"$f":"IF(A9=\"\",\"\",A9)","v":"C"},"","","","","",0,0]
[{"$f":"IF(A10=\"\",\"\",A10)","v":"D"},"","","","","",0,0]
[{"$f":"IF(A11=\"\",\"\",A11)","v":"E"},"","","","","",0,0]
[{"$f":"IF(A12=\"\",\"\",A12)","v":"F"},"","","","","",1,0]
[null,{"$f":"SUM(B17:B22)","v":0},0,0,0,0,1]
[]
[]
["Prueba de consistencia"]
[]
[{"$f":"A17","v":"A"},{"$f":"IFERROR(((B7*$H$17)+(C7*$H$18)+(D7*$H$19)+(E7*$H$20)+(F7*$H$21)+(G7*$H$22)),\"\")","v":0},{"$f":"IFERROR((B28/H17),\"\")","v":""}]
[{"$f":"IF(A8=\"\",\"\",A8)","v":"B"},{"$f":"IFERROR(((B8*$H$17)+(C8*$H$18)+(D8*$H$19)+(E8*$H$20)+(F8*$H$21)+(G8*$H$22)),\"\")","v":""},""]
[{"$f":"IF(A9=\"\",\"\",A9)","v":"C"},"",""]
[{"$f":"IF(A10=\"\",\"\",A10)","v":"D"},"",""]
[{"$f":"IF(A11=\"\",\"\",A11)","v":"E"},"",""]
[{"$f":"IF(A12=\"\",\"\",A12)","v":"F"},"",""]
[null,null,{"$f":"SUM(C28:C33)","v":0}]
[]
["n:",{"$f":"COUNTA(Parámetros!A18:A23)","v":6}]
["FACTOR:",{"$f":"(1/COUNT(C28:C33))*C34","v":{"$error":"#DIV/0!"}}]
["INDICE DE CONS:",{"$f":"(B37-COUNT(C28:C33))/(COUNT(C28:C33)-1)","v":{"$error":"#DIV/0!"}}]
["IA (nxn):",{"$f":"VLOOKUP(B36,Parámetros!B27:C35,2,0)","v":1.25}]
["CONSISTENCIA:",{"$f":"IF((B39*(VLOOKUP(B36,Parámetros!B27:D35,3,0)))<B38,\"Inconsistencias serias\",\"Grado de consistencia satisfactorio\")","v":{"$error":"#DIV/0!"}}]

{"sheet":"Factor 3","index":4,"n_rows":40,"n_cols":8,"rows_kept":40,"cut":false,"hidden":false,"merged":[]}
[{"$f":"Factores!A7","v":"Factor 3"}]
[]
[]
[]
[]
[null,{"$f":"A7","v":"A"},{"$f":"IF(A8=\"\",\"\",A8)","v":"B"},{"$f":"IF(A9=\"\",\"\",A9)","v":"C"},{"$f":"IF(A10=\"\",\"\",A10)","v":"D"},{"$f":"IF(A11=\"\",\"\",A11)","v":"E"},{"$f":"IF(A12=\"\",\"\",A12)","v":"F"}]
[{"$f":"IF((Parámetros!A18)=\"\",\"\",(Parámetros!A18))","v":"A"},1]
[{"$f":"IF((Parámetros!A19)=\"\",\"\",(Parámetros!A19))","v":"B"},{"$f":"IF($A8=\"\",\"\",(1/C7))","v":{"$error":"#DIV/0!"}},1]
[{"$f":"IF((Parámetros!A20)=\"\",\"\",(Parámetros!A20))","v":"C"},{"$f":"IF($A9=\"\",\"\",(1/D7))","v":{"$error":"#DIV/0!"}},{"$f":"IF($A9=\"\",\"\",(1/D8))","v":{"$error":"#DIV/0!"}},1]
[{"$f":"IF((Parámetros!A21)=\"\",\"\",(Parámetros!A21))","v":"D"},{"$f":"IF($A10=\"\",\"\",(1/E7))","v":{"$error":"#DIV/0!"}},{"$f":"IF($A10=\"\",\"\",(1/E8))","v":{"$error":"#DIV/0!"}},{"$f":"IF($A10=\"\",\"\",(1/E9))","v":{"$error":"#DIV/0!"}},1]
[{"$f":"IF((Parámetros!A22)=\"\",\"\",(Parámetros!A22))","v":"E"},{"$f":"IF($A11=\"\",\"\",(1/F7))","v":{"$error":"#DIV/0!"}},{"$f":"IF($A11=\"\",\"\",(1/F8))","v":{"$error":"#DIV/0!"}},{"$f":"IF($A11=\"\",\"\",(1/F9))","v":{"$error":"#DIV/0!"}},{"$f":"IF($A11=\"\",\"\",(1/F10))","v":{"$error":"#DIV/0!"}},1]
[{"$f":"IF((Parámetros!A23)=\"\",\"\",(Parámetros!A23))","v":"F"},{"$f":"IF($A12=\"\",\"\",(1/G7))","v":{"$error":"#DIV/0!"}},{"$f":"IF($A12=\"\",\"\",(1/G8))","v":{"$error":"#DIV/0!"}},{"$f":"IF($A12=\"\",\"\",(1/G9))","v":{"$error":"#DIV/0!"}},{"$f":"IF($A12=\"\",\"\",(1/G10))","v":{"$error":"#DIV/0!"}},{"$f":"IF($A12=\"\",\"\",(1/G11))","v":{"$error":"#DIV/0!"}},1]
[null,{"$f":"SUM(B7:B12)","v":{"$error":"#DIV/0!"}},{"$error":"#DIV/0!"},{"$error":"#DIV/0!"},{"$error":"#DIV/0!"},{"$error":"#DIV/0!"},1]
[]
[]
[null,{"$f":"B6","v":"A"},"B","C","D","E","F"]
[{"$f":"A7","v":"A"},{"$f":"IFERROR((B7/B$13),\"\")","v":""},{"$f":"IFERROR((C7/C$13),\"\")","v":""},"","","",0,{"$f":"IFERROR((IF((AVERAGEIF(B17:G17,\">0\"))=1,0,(AVERAGEIF(B17:G17,\">0\")))),0)","v":0}]
[{"$f":"IF(A8=\"\",\"\",A8)","v":"B"},{"$f":"IFERROR((B8/B$13),\"\")","v":""},"","","","",0,{"$f":"IFERROR((IF((AVERAGEIF(B18:G18,\">0\"))=1,0,(AVERAGEIF(B18:G18,\">0\")))),0)","v":0}]
[{"$f":"IF(A9=\"\",\"\",A9)","v":"C"},"","","","","",0,0]
[{"$f":"IF(A10=\"\",\"\",A10)","v":"D"},"","","","","",0,0]
[{"$f":"IF(A11=\"\",\"\",A11)","v":"E"},"","","","","",0,0]
[{"$f":"IF(A12=\"\",\"\",A12)","v":"F"},"","","","","",1,0]
[null,{"$f":"SUM(B17:B22)","v":0},0,0,0,0,1]
[]
[]
["Prueba de consistencia"]
[]
[{"$f":"A17","v":"A"},{"$f":"IFERROR(((B7*$H$17)+(C7*$H$18)+(D7*$H$19)+(E7*$H$20)+(F7*$H$21)+(G7*$H$22)),\"\")","v":0},{"$f":"IFERROR((B28/H17),\"\")","v":""}]
[{"$f":"IF(A8=\"\",\"\",A8)","v":"B"},{"$f":"IFERROR(((B8*$H$17)+(C8*$H$18)+(D8*$H$19)+(E8*$H$20)+(F8*$H$21)+(G8*$H$22)),\"\")","v":""},""]
[{"$f":"IF(A9=\"\",\"\",A9)","v":"C"},"",""]
[{"$f":"IF(A10=\"\",\"\",A10)","v":"D"},"",""]
[{"$f":"IF(A11=\"\",\"\",A11)","v":"E"},"",""]
[{"$f":"IF(A12=\"\",\"\",A12)","v":"F"},"",""]
[null,null,{"$f":"SUM(C28:C33)","v":0}]
[]
["n:",{"$f":"COUNTA(Parámetros!A18:A23)","v":6}]
["FACTOR:",{"$f":"(1/COUNT(C28:C33))*C34","v":{"$error":"#DIV/0!"}}]
["INDICE DE CONS:",{"$f":"(B37-COUNT(C28:C33))/(COUNT(C28:C33)-1)","v":{"$error":"#DIV/0!"}}]
["IA (nxn):",{"$f":"VLOOKUP(B36,Parámetros!B27:C35,2,0)","v":1.25}]
["CONSISTENCIA:",{"$f":"IF((B39*(VLOOKUP(B36,Parámetros!B27:D35,3,0)))<B38,\"Inconsistencias serias\",\"Grado de consistencia satisfactorio\")","v":{"$error":"#DIV/0!"}}]

{"sheet":"Factor 4","index":5,"n_rows":40,"n_cols":8,"rows_kept":40,"cut":false,"hidden":false,"merged":[]}
[{"$f":"Factores!A8","v":"Factor 4"}]
[]
[]
[]
[]
[null,{"$f":"A7","v":"A"},{"$f":"IF(A8=\"\",\"\",A8)","v":"B"},{"$f":"IF(A9=\"\",\"\",A9)","v":"C"},{"$f":"IF(A10=\"\",\"\",A10)","v":"D"},{"$f":"IF(A11=\"\",\"\",A11)","v":"E"},{"$f":"IF(A12=\"\",\"\",A12)","v":"F"}]
[{"$f":"IF((Parámetros!A18)=\"\",\"\",(Parámetros!A18))","v":"A"},1]
[{"$f":"IF((Parámetros!A19)=\"\",\"\",(Parámetros!A19))","v":"B"},{"$f":"IF($A8=\"\",\"\",(1/C7))","v":{"$error":"#DIV/0!"}},1]
[{"$f":"IF((Parámetros!A20)=\"\",\"\",(Parámetros!A20))","v":"C"},{"$f":"IF($A9=\"\",\"\",(1/D7))","v":{"$error":"#DIV/0!"}},{"$f":"IF($A9=\"\",\"\",(1/D8))","v":{"$error":"#DIV/0!"}},1]
[{"$f":"IF((Parámetros!A21)=\"\",\"\",(Parámetros!A21))","v":"D"},{"$f":"IF($A10=\"\",\"\",(1/E7))","v":{"$error":"#DIV/0!"}},{"$f":"IF($A10=\"\",\"\",(1/E8))","v":{"$error":"#DIV/0!"}},{"$f":"IF($A10=\"\",\"\",(1/E9))","v":{"$error":"#DIV/0!"}},1]
[{"$f":"IF((Parámetros!A22)=\"\",\"\",(Parámetros!A22))","v":"E"},{"$f":"IF($A11=\"\",\"\",(1/F7))","v":{"$error":"#DIV/0!"}},{"$f":"IF($A11=\"\",\"\",(1/F8))","v":{"$error":"#DIV/0!"}},{"$f":"IF($A11=\"\",\"\",(1/F9))","v":{"$error":"#DIV/0!"}},{"$f":"IF($A11=\"\",\"\",(1/F10))","v":{"$error":"#DIV/0!"}},1]
[{"$f":"IF((Parámetros!A23)=\"\",\"\",(Parámetros!A23))","v":"F"},{"$f":"IF($A12=\"\",\"\",(1/G7))","v":{"$error":"#DIV/0!"}},{"$f":"IF($A12=\"\",\"\",(1/G8))","v":{"$error":"#DIV/0!"}},{"$f":"IF($A12=\"\",\"\",(1/G9))","v":{"$error":"#DIV/0!"}},{"$f":"IF($A12=\"\",\"\",(1/G10))","v":{"$error":"#DIV/0!"}},{"$f":"IF($A12=\"\",\"\",(1/G11))","v":{"$error":"#DIV/0!"}},1]
[null,{"$f":"SUM(B7:B12)","v":{"$error":"#DIV/0!"}},{"$error":"#DIV/0!"},{"$error":"#DIV/0!"},{"$error":"#DIV/0!"},{"$error":"#DIV/0!"},1]
[]
[]
[null,{"$f":"B6","v":"A"},"B","C","D","E","F"]
[{"$f":"A7","v":"A"},{"$f":"IFERROR((B7/B$13),\"\")","v":""},{"$f":"IFERROR((C7/C$13),\"\")","v":""},"","","",0,{"$f":"IFERROR((IF((AVERAGEIF(B17:G17,\">0\"))=1,0,(AVERAGEIF(B17:G17,\">0\")))),0)","v":0}]
[{"$f":"IF(A8=\"\",\"\",A8)","v":"B"},{"$f":"IFERROR((B8/B$13),\"\")","v":""},"","","","",0,{"$f":"IFERROR((IF((AVERAGEIF(B18:G18,\">0\"))=1,0,(AVERAGEIF(B18:G18,\">0\")))),0)","v":0}]
[{"$f":"IF(A9=\"\",\"\",A9)","v":"C"},"","","","","",0,0]
[{"$f":"IF(A10=\"\",\"\",A10)","v":"D"},"","","","","",0,0]
[{"$f":"IF(A11=\"\",\"\",A11)","v":"E"},"","","","","",0,0]
[{"$f":"IF(A12=\"\",\"\",A12)","v":"F"},"","","","","",1,0]
[null,{"$f":"SUM(B17:B22)","v":0},0,0,0,0,1]
[]
[]
["Prueba de consistencia"]
[]
[{"$f":"A17","v":"A"},{"$f":"IFERROR(((B7*$H$17)+(C7*$H$18)+(D7*$H$19)+(E7*$H$20)+(F7*$H$21)+(G7*$H$22)),\"\")","v":0},{"$f":"IFERROR((B28/H17),\"\")","v":""}]
[{"$f":"IF(A8=\"\",\"\",A8)","v":"B"},{"$f":"IFERROR(((B8*$H$17)+(C8*$H$18)+(D8*$H$19)+(E8*$H$20)+(F8*$H$21)+(G8*$H$22)),\"\")","v":""},""]
[{"$f":"IF(A9=\"\",\"\",A9)","v":"C"},"",""]
[{"$f":"IF(A10=\"\",\"\",A10)","v":"D"},"",""]
[{"$f":"IF(A11=\"\",\"\",A11)","v":"E"},"",""]
[{"$f":"IF(A12=\"\",\"\",A12)","v":"F"},"",""]
[null,null,{"$f":"SUM(C28:C33)","v":0}]
[]
["n:",{"$f":"COUNTA(Parámetros!A18:A23)","v":6}]
["FACTOR:",{"$f":"(1/COUNT(C28:C33))*C34","v":{"$error":"#DIV/0!"}}]
["INDICE DE CONS:",{"$f":"(B37-COUNT(C28:C33))/(COUNT(C28:C33)-1)","v":{"$error":"#DIV/0!"}}]
["IA (nxn):",{"$f":"VLOOKUP(B36,Parámetros!B27:C35,2,0)","v":1.25}]
["CONSISTENCIA:",{"$f":"IF((B39*(VLOOKUP(B36,Parámetros!B27:D35,3,0)))<B38,\"Inconsistencias serias\",\"Grado de consistencia satisfactorio\")","v":{"$error":"#DIV/0!"}}]

{"sheet":"Factor 5","index":6,"n_rows":40,"n_cols":8,"rows_kept":40,"cut":false,"hidden":false,"merged":[]}
[{"$f":"Factores!A9","v":"Factor 5"}]
[]
[]
[]
[]
[null,{"$f":"A7","v":"A"},{"$f":"IF(A8=\"\",\"\",A8)","v":"B"},{"$f":"IF(A9=\"\",\"\",A9)","v":"C"},{"$f":"IF(A10=\"\",\"\",A10)","v":"D"},{"$f":"IF(A11=\"\",\"\",A11)","v":"E"},{"$f":"IF(A12=\"\",\"\",A12)","v":"F"}]
[{"$f":"IF((Parámetros!A18)=\"\",\"\",(Parámetros!A18))","v":"A"},1]
[{"$f":"IF((Parámetros!A19)=\"\",\"\",(Parámetros!A19))","v":"B"},{"$f":"IF($A8=\"\",\"\",(1/C7))","v":{"$error":"#DIV/0!"}},1]
[{"$f":"IF((Parámetros!A20)=\"\",\"\",(Parámetros!A20))","v":"C"},{"$f":"IF($A9=\"\",\"\",(1/D7))","v":{"$error":"#DIV/0!"}},{"$f":"IF($A9=\"\",\"\",(1/D8))","v":{"$error":"#DIV/0!"}},1]
[{"$f":"IF((Parámetros!A21)=\"\",\"\",(Parámetros!A21))","v":"D"},{"$f":"IF($A10=\"\",\"\",(1/E7))","v":{"$error":"#DIV/0!"}},{"$f":"IF($A10=\"\",\"\",(1/E8))","v":{"$error":"#DIV/0!"}},{"$f":"IF($A10=\"\",\"\",(1/E9))","v":{"$error":"#DIV/0!"}},1]
[{"$f":"IF((Parámetros!A22)=\"\",\"\",(Parámetros!A22))","v":"E"},{"$f":"IF($A11=\"\",\"\",(1/F7))","v":{"$error":"#DIV/0!"}},{"$f":"IF($A11=\"\",\"\",(1/F8))","v":{"$error":"#DIV/0!"}},{"$f":"IF($A11=\"\",\"\",(1/F9))","v":{"$error":"#DIV/0!"}},{"$f":"IF($A11=\"\",\"\",(1/F10))","v":{"$error":"#DIV/0!"}},1]
[{"$f":"IF((Parámetros!A23)=\"\",\"\",(Parámetros!A23))","v":"F"},{"$f":"IF($A12=\"\",\"\",(1/G7))","v":{"$error":"#DIV/0!"}},{"$f":"IF($A12=\"\",\"\",(1/G8))","v":{"$error":"#DIV/0!"}},{"$f":"IF($A12=\"\",\"\",(1/G9))","v":{"$error":"#DIV/0!"}},{"$f":"IF($A12=\"\",\"\",(1/G10))","v":{"$error":"#DIV/0!"}},{"$f":"IF($A12=\"\",\"\",(1/G11))","v":{"$error":"#DIV/0!"}},1]
[null,{"$f":"SUM(B7:B12)","v":{"$error":"#DIV/0!"}},{"$error":"#DIV/0!"},{"$error":"#DIV/0!"},{"$error":"#DIV/0!"},{"$error":"#DIV/0!"},1]
[]
[]
[null,{"$f":"B6","v":"A"},"B","C","D","E","F"]
[{"$f":"A7","v":"A"},{"$f":"IFERROR((B7/B$13),\"\")","v":""},{"$f":"IFERROR((C7/C$13),\"\")","v":""},"","","",0,{"$f":"IFERROR((IF((AVERAGEIF(B17:G17,\">0\"))=1,0,(AVERAGEIF(B17:G17,\">0\")))),0)","v":0}]
[{"$f":"IF(A8=\"\",\"\",A8)","v":"B"},{"$f":"IFERROR((B8/B$13),\"\")","v":""},"","","","",0,{"$f":"IFERROR((IF((AVERAGEIF(B18:G18,\">0\"))=1,0,(AVERAGEIF(B18:G18,\">0\")))),0)","v":0}]
[{"$f":"IF(A9=\"\",\"\",A9)","v":"C"},"","","","","",0,0]
[{"$f":"IF(A10=\"\",\"\",A10)","v":"D"},"","","","","",0,0]
[{"$f":"IF(A11=\"\",\"\",A11)","v":"E"},"","","","","",0,0]
[{"$f":"IF(A12=\"\",\"\",A12)","v":"F"},"","","","","",1,0]
[null,{"$f":"SUM(B17:B22)","v":0},0,0,0,0,1]
[]
[]
["Prueba de consistencia"]
[]
[{"$f":"A17","v":"A"},{"$f":"IFERROR(((B7*$H$17)+(C7*$H$18)+(D7*$H$19)+(E7*$H$20)+(F7*$H$21)+(G7*$H$22)),\"\")","v":0},{"$f":"IFERROR((B28/H17),\"\")","v":""}]
[{"$f":"IF(A8=\"\",\"\",A8)","v":"B"},{"$f":"IFERROR(((B8*$H$17)+(C8*$H$18)+(D8*$H$19)+(E8*$H$20)+(F8*$H$21)+(G8*$H$22)),\"\")","v":""},""]
[{"$f":"IF(A9=\"\",\"\",A9)","v":"C"},"",""]
[{"$f":"IF(A10=\"\",\"\",A10)","v":"D"},"",""]
[{"$f":"IF(A11=\"\",\"\",A11)","v":"E"},"",""]
[{"$f":"IF(A12=\"\",\"\",A12)","v":"F"},"",""]
[null,null,{"$f":"SUM(C28:C33)","v":0}]
[]
["n:",{"$f":"COUNTA(Parámetros!A18:A23)","v":6}]
["FACTOR:",{"$f":"(1/COUNT(C28:C33))*C34","v":{"$error":"#DIV/0!"}}]
["INDICE DE CONS:",{"$f":"(B37-COUNT(C28:C33))/(COUNT(C28:C33)-1)","v":{"$error":"#DIV/0!"}}]
["IA (nxn):",{"$f":"VLOOKUP(B36,Parámetros!B27:C35,2,0)","v":1.25}]
["CONSISTENCIA:",{"$f":"IF((B39*(VLOOKUP(B36,Parámetros!B27:D35,3,0)))<B38,\"Inconsistencias serias\",\"Grado de consistencia satisfactorio\")","v":{"$error":"#DIV/0!"}}]

{"sheet":"Factor 6","index":7,"n_rows":40,"n_cols":8,"rows_kept":40,"cut":false,"hidden":false,"merged":[]}
[{"$f":"Factores!A10","v":"Factor 6"}]
[]
[]
[]
[]
[null,{"$f":"A7","v":"A"},{"$f":"IF(A8=\"\",\"\",A8)","v":"B"},{"$f":"IF(A9=\"\",\"\",A9)","v":"C"},{"$f":"IF(A10=\"\",\"\",A10)","v":"D"},{"$f":"IF(A11=\"\",\"\",A11)","v":"E"},{"$f":"IF(A12=\"\",\"\",A12)","v":"F"}]
[{"$f":"IF((Parámetros!A18)=\"\",\"\",(Parámetros!A18))","v":"A"},1]
[{"$f":"IF((Parámetros!A19)=\"\",\"\",(Parámetros!A19))","v":"B"},{"$f":"IF($A8=\"\",\"\",(1/C7))","v":{"$error":"#DIV/0!"}},1]
[{"$f":"IF((Parámetros!A20)=\"\",\"\",(Parámetros!A20))","v":"C"},{"$f":"IF($A9=\"\",\"\",(1/D7))","v":{"$error":"#DIV/0!"}},{"$f":"IF($A9=\"\",\"\",(1/D8))","v":{"$error":"#DIV/0!"}},1]
[{"$f":"IF((Parámetros!A21)=\"\",\"\",(Parámetros!A21))","v":"D"},{"$f":"IF($A10=\"\",\"\",(1/E7))","v":{"$error":"#DIV/0!"}},{"$f":"IF($A10=\"\",\"\",(1/E8))","v":{"$error":"#DIV/0!"}},{"$f":"IF($A10=\"\",\"\",(1/E9))","v":{"$error":"#DIV/0!"}},1]
[{"$f":"IF((Parámetros!A22)=\"\",\"\",(Parámetros!A22))","v":"E"},{"$f":"IF($A11=\"\",\"\",(1/F7))","v":{"$error":"#DIV/0!"}},{"$f":"IF($A11=\"\",\"\",(1/F8))","v":{"$error":"#DIV/0!"}},{"$f":"IF($A11=\"\",\"\",(1/F9))","v":{"$error":"#DIV/0!"}},{"$f":"IF($A11=\"\",\"\",(1/F10))","v":{"$error":"#DIV/0!"}},1]
[{"$f":"IF((Parámetros!A23)=\"\",\"\",(Parámetros!A23))","v":"F"},{"$f":"IF($A12=\"\",\"\",(1/G7))","v":{"$error":"#DIV/0!"}},{"$f":"IF($A12=\"\",\"\",(1/G8))","v":{"$error":"#DIV/0!"}},{"$f":"IF($A12=\"\",\"\",(1/G9))","v":{"$error":"#DIV/0!"}},{"$f":"IF($A12=\"\",\"\",(1/G10))","v":{"$error":"#DIV/0!"}},{"$f":"IF($A12=\"\",\"\",(1/G11))","v":{"$error":"#DIV/0!"}},1]
[null,{"$f":"SUM(B7:B12)","v":{"$error":"#DIV/0!"}},{"$error":"#DIV/0!"},{"$error":"#DIV/0!"},{"$error":"#DIV/0!"},{"$error":"#DIV/0!"},1]
[]
[]
[null,{"$f":"B6","v":"A"},"B","C","D","E","F"]
[{"$f":"A7","v":"A"},{"$f":"IFERROR((B7/B$13),\"\")","v":""},{"$f":"IFERROR((C7/C$13),\"\")","v":""},"","","",0,{"$f":"IFERROR((IF((AVERAGEIF(B17:G17,\">0\"))=1,0,(AVERAGEIF(B17:G17,\">0\")))),0)","v":0}]
[{"$f":"IF(A8=\"\",\"\",A8)","v":"B"},{"$f":"IFERROR((B8/B$13),\"\")","v":""},"","","","",0,{"$f":"IFERROR((IF((AVERAGEIF(B18:G18,\">0\"))=1,0,(AVERAGEIF(B18:G18,\">0\")))),0)","v":0}]
[{"$f":"IF(A9=\"\",\"\",A9)","v":"C"},"","","","","",0,0]
[{"$f":"IF(A10=\"\",\"\",A10)","v":"D"},"","","","","",0,0]
[{"$f":"IF(A11=\"\",\"\",A11)","v":"E"},"","","","","",0,0]
[{"$f":"IF(A12=\"\",\"\",A12)","v":"F"},"","","","","",1,0]
[null,{"$f":"SUM(B17:B22)","v":0},0,0,0,0,1]
[]
[]
["Prueba de consistencia"]
[]
[{"$f":"A17","v":"A"},{"$f":"IFERROR(((B7*$H$17)+(C7*$H$18)+(D7*$H$19)+(E7*$H$20)+(F7*$H$21)+(G7*$H$22)),\"\")","v":0},{"$f":"IFERROR((B28/H17),\"\")","v":""}]
[{"$f":"IF(A8=\"\",\"\",A8)","v":"B"},{"$f":"IFERROR(((B8*$H$17)+(C8*$H$18)+(D8*$H$19)+(E8*$H$20)+(F8*$H$21)+(G8*$H$22)),\"\")","v":""},""]
[{"$f":"IF(A9=\"\",\"\",A9)","v":"C"},"",""]
[{"$f":"IF(A10=\"\",\"\",A10)","v":"D"},"",""]
[{"$f":"IF(A11=\"\",\"\",A11)","v":"E"},"",""]
[{"$f":"IF(A12=\"\",\"\",A12)","v":"F"},"",""]
[null,null,{"$f":"SUM(C28:C33)","v":0}]
[]
["n:",{"$f":"COUNTA(Parámetros!A18:A23)","v":6}]
["FACTOR:",{"$f":"(1/COUNT(C28:C33))*C34","v":{"$error":"#DIV/0!"}}]
["INDICE DE CONS:",{"$f":"(B37-COUNT(C28:C33))/(COUNT(C28:C33)-1)","v":{"$error":"#DIV/0!"}}]
["IA (nxn):",{"$f":"VLOOKUP(B36,Parámetros!B27:C35,2,0)","v":1.25}]
["CONSISTENCIA:",{"$f":"IF((B39*(VLOOKUP(B36,Parámetros!B27:D35,3,0)))<B38,\"Inconsistencias serias\",\"Grado de consistencia satisfactorio\")","v":{"$error":"#DIV/0!"}}]

{"sheet":"Factor 7","index":8,"n_rows":40,"n_cols":8,"rows_kept":40,"cut":false,"hidden":false,"merged":[]}
[{"$f":"Factores!A11","v":"Factor 7"}]
[]
[]
[]
[]
[null,{"$f":"A7","v":"A"},{"$f":"IF(A8=\"\",\"\",A8)","v":"B"},{"$f":"IF(A9=\"\",\"\",A9)","v":"C"},{"$f":"IF(A10=\"\",\"\",A10)","v":"D"},{"$f":"IF(A11=\"\",\"\",A11)","v":"E"},{"$f":"IF(A12=\"\",\"\",A12)","v":"F"}]
[{"$f":"IF((Parámetros!A18)=\"\",\"\",(Parámetros!A18))","v":"A"},1]
[{"$f":"IF((Parámetros!A19)=\"\",\"\",(Parámetros!A19))","v":"B"},{"$f":"IF($A8=\"\",\"\",(1/C7))","v":{"$error":"#DIV/0!"}},1]
[{"$f":"IF((Parámetros!A20)=\"\",\"\",(Parámetros!A20))","v":"C"},{"$f":"IF($A9=\"\",\"\",(1/D7))","v":{"$error":"#DIV/0!"}},{"$f":"IF($A9=\"\",\"\",(1/D8))","v":{"$error":"#DIV/0!"}},1]
[{"$f":"IF((Parámetros!A21)=\"\",\"\",(Parámetros!A21))","v":"D"},{"$f":"IF($A10=\"\",\"\",(1/E7))","v":{"$error":"#DIV/0!"}},{"$f":"IF($A10=\"\",\"\",(1/E8))","v":{"$error":"#DIV/0!"}},{"$f":"IF($A10=\"\",\"\",(1/E9))","v":{"$error":"#DIV/0!"}},1]
[{"$f":"IF((Parámetros!A22)=\"\",\"\",(Parámetros!A22))","v":"E"},{"$f":"IF($A11=\"\",\"\",(1/F7))","v":{"$error":"#DIV/0!"}},{"$f":"IF($A11=\"\",\"\",(1/F8))","v":{"$error":"#DIV/0!"}},{"$f":"IF($A11=\"\",\"\",(1/F9))","v":{"$error":"#DIV/0!"}},{"$f":"IF($A11=\"\",\"\",(1/F10))","v":{"$error":"#DIV/0!"}},1]
[{"$f":"IF((Parámetros!A23)=\"\",\"\",(Parámetros!A23))","v":"F"},{"$f":"IF($A12=\"\",\"\",(1/G7))","v":{"$error":"#DIV/0!"}},{"$f":"IF($A12=\"\",\"\",(1/G8))","v":{"$error":"#DIV/0!"}},{"$f":"IF($A12=\"\",\"\",(1/G9))","v":{"$error":"#DIV/0!"}},{"$f":"IF($A12=\"\",\"\",(1/G10))","v":{"$error":"#DIV/0!"}},{"$f":"IF($A12=\"\",\"\",(1/G11))","v":{"$error":"#DIV/0!"}},1]
[null,{"$f":"SUM(B7:B12)","v":{"$error":"#DIV/0!"}},{"$error":"#DIV/0!"},{"$error":"#DIV/0!"},{"$error":"#DIV/0!"},{"$error":"#DIV/0!"},1]
[]
[]
[null,{"$f":"B6","v":"A"},"B","C","D","E","F"]
[{"$f":"A7","v":"A"},{"$f":"IFERROR((B7/B$13),\"\")","v":""},{"$f":"IFERROR((C7/C$13),\"\")","v":""},"","","",0,{"$f":"IFERROR((IF((AVERAGEIF(B17:G17,\">0\"))=1,0,(AVERAGEIF(B17:G17,\">0\")))),0)","v":0}]
[{"$f":"IF(A8=\"\",\"\",A8)","v":"B"},{"$f":"IFERROR((B8/B$13),\"\")","v":""},"","","","",0,{"$f":"IFERROR((IF((AVERAGEIF(B18:G18,\">0\"))=1,0,(AVERAGEIF(B18:G18,\">0\")))),0)","v":0}]
[{"$f":"IF(A9=\"\",\"\",A9)","v":"C"},"","","","","",0,0]
[{"$f":"IF(A10=\"\",\"\",A10)","v":"D"},"","","","","",0,0]
[{"$f":"IF(A11=\"\",\"\",A11)","v":"E"},"","","","","",0,0]
[{"$f":"IF(A12=\"\",\"\",A12)","v":"F"},"","","","","",1,0]
[null,{"$f":"SUM(B17:B22)","v":0},0,0,0,0,1]
[]
[]
["Prueba de consistencia"]
[]
[{"$f":"A17","v":"A"},{"$f":"IFERROR(((B7*$H$17)+(C7*$H$18)+(D7*$H$19)+(E7*$H$20)+(F7*$H$21)+(G7*$H$22)),\"\")","v":0},{"$f":"IFERROR((B28/H17),\"\")","v":""}]
[{"$f":"IF(A8=\"\",\"\",A8)","v":"B"},{"$f":"IFERROR(((B8*$H$17)+(C8*$H$18)+(D8*$H$19)+(E8*$H$20)+(F8*$H$21)+(G8*$H$22)),\"\")","v":""},""]
[{"$f":"IF(A9=\"\",\"\",A9)","v":"C"},"",""]
[{"$f":"IF(A10=\"\",\"\",A10)","v":"D"},"",""]
[{"$f":"IF(A11=\"\",\"\",A11)","v":"E"},"",""]
[{"$f":"IF(A12=\"\",\"\",A12)","v":"F"},"",""]
[null,null,{"$f":"SUM(C28:C33)","v":0}]
[]
["n:",{"$f":"COUNTA(Parámetros!A18:A23)","v":6}]
["FACTOR:",{"$f":"(1/COUNT(C28:C33))*C34","v":{"$error":"#DIV/0!"}}]
["INDICE DE CONS:",{"$f":"(B37-COUNT(C28:C33))/(COUNT(C28:C33)-1)","v":{"$error":"#DIV/0!"}}]
["IA (nxn):",{"$f":"VLOOKUP(B36,Parámetros!B27:C35,2,0)","v":1.25}]
["CONSISTENCIA:",{"$f":"IF((B39*(VLOOKUP(B36,Parámetros!B27:D35,3,0)))<B38,\"Inconsistencias serias\",\"Grado de consistencia satisfactorio\")","v":{"$error":"#DIV/0!"}}]

{"sheet":"Factor 8","index":9,"n_rows":40,"n_cols":10,"rows_kept":40,"cut":false,"hidden":false,"merged":[]}
[{"$f":"Factores!A12","v":"Factor 8"}]
[]
[]
[]
[null,null,null,null,null,{"$f":"COUNTA(A6:A14)","v":6}]
[null,{"$f":"A7","v":"A"},{"$f":"IF(A8=\"\",\"\",A8)","v":"B"},{"$f":"IF(A9=\"\",\"\",A9)","v":"C"},{"$f":"IF(A10=\"\",\"\",A10)","v":"D"},{"$f":"COUNTA(A18:A23)","v":5},{"$f":"IF(A12=\"\",\"\",A12)","v":"F"}]
[{"$f":"IF((Parámetros!A18)=\"\",\"\",(Parámetros!A18))","v":"A"},1]
[{"$f":"IF((Parámetros!A19)=\"\",\"\",(Parámetros!A19))","v":"B"},{"$f":"IF($A8=\"\",\"\",(1/C7))","v":{"$error":"#DIV/0!"}},1]
[{"$f":"IF((Parámetros!A20)=\"\",\"\",(Parámetros!A20))","v":"C"},{"$f":"IF($A9=\"\",\"\",(1/D7))","v":{"$error":"#DIV/0!"}},{"$f":"IF($A9=\"\",\"\",(1/D8))","v":{"$error":"#DIV/0!"}},1]
[{"$f":"IF((Parámetros!A21)=\"\",\"\",(Parámetros!A21))","v":"D"},{"$f":"IF($A10=\"\",\"\",(1/E7))","v":{"$error":"#DIV/0!"}},{"$f":"IF($A10=\"\",\"\",(1/E8))","v":{"$error":"#DIV/0!"}},{"$f":"IF($A10=\"\",\"\",(1/E9))","v":{"$error":"#DIV/0!"}},1]
[{"$f":"IF((Parámetros!A22)=\"\",\"\",(Parámetros!A22))","v":"E"},{"$f":"IF($A11=\"\",\"\",(1/F7))","v":{"$error":"#DIV/0!"}},{"$f":"IF($A11=\"\",\"\",(1/F8))","v":{"$error":"#DIV/0!"}},{"$f":"IF($A11=\"\",\"\",(1/F9))","v":{"$error":"#DIV/0!"}},{"$f":"IF($A11=\"\",\"\",(1/F10))","v":{"$error":"#DIV/0!"}},1]
[{"$f":"IF((Parámetros!A23)=\"\",\"\",(Parámetros!A23))","v":"F"},{"$f":"IF($A12=\"\",\"\",(1/G7))","v":{"$error":"#DIV/0!"}},{"$f":"IF($A12=\"\",\"\",(1/G8))","v":{"$error":"#DIV/0!"}},{"$f":"IF($A12=\"\",\"\",(1/G9))","v":{"$error":"#DIV/0!"}},{"$f":"IF($A12=\"\",\"\",(1/G10))","v":{"$error":"#DIV/0!"}},{"$f":"IF($A12=\"\",\"\",(1/G11))","v":{"$error":"#DIV/0!"}},1]
[null,{"$f":"SUM(B7:B12)","v":{"$error":"#DIV/0!"}},{"$error":"#DIV/0!"},{"$error":"#DIV/0!"},{"$error":"#DIV/0!"},{"$error":"#DIV/0!"},1]
[]
[]
[null,{"$f":"B6","v":"A"},"B","C","D",5,"F"]
[{"$f":"A7","v":"A"},{"$f":"IFERROR((B7/B$13),\"\")","v":""},{"$f":"IFERROR((C7/C$13),\"\")","v":""},"","","",0,{"$f":"IFERROR((IF((AVERAGEIF(B17:G17,\">0\"))=1,0,(AVERAGEIF(B17:G17,\">0\")))),0)","v":0}]
[{"$f":"IF(A8=\"\",\"\",A8)","v":"B"},{"$f":"IFERROR((B8/B$13),\"\")","v":""},"","","","",0,{"$f":"IFERROR((IF((AVERAGEIF(B18:G18,\">0\"))=1,0,(AVERAGEIF(B18:G18,\">0\")))),0)","v":0},null,{"$f":"IF((AVERAGEIF(B18:G18,\">0\"))=1,0,(AVERAGEIF(B18:G18,\">0\")))","v":{"$error":"#DIV/0!"}}]
[{"$f":"IF(A9=\"\",\"\",A9)","v":"C"},"","","","","",0,0]
[{"$f":"IF(A10=\"\",\"\",A10)","v":"D"},"","","","","",0,0]
[{"$f":"IF(A11=\"\",\"\",A11)","v":"E"},"","","","","",0,0]
[{"$f":"IF(A12=\"\",\"\",A12)","v":"F"},"","","","","",1,0]
[null,{"$f":"SUM(B17:B22)","v":0},0,0,0,0,1]
[]
[]
["Prueba de consistencia"]
[]
[{"$f":"A17","v":"A"},{"$f":"IFERROR(((B7*$H$17)+(C7*$H$18)+(D7*$H$19)+(E7*$H$20)+(F7*$H$21)+(G7*$H$22)),\"\")","v":0},{"$f":"IFERROR((B28/H17),\"\")","v":""}]
[{"$f":"IF(A8=\"\",\"\",A8)","v":"B"},{"$f":"IFERROR(((B8*$H$17)+(C8*$H$18)+(D8*$H$19)+(E8*$H$20)+(F8*$H$21)+(G8*$H$22)),\"\")","v":""},""]
[{"$f":"IF(A9=\"\",\"\",A9)","v":"C"},"",""]
[{"$f":"IF(A10=\"\",\"\",A10)","v":"D"},"",""]
[{"$f":"IF(A11=\"\",\"\",A11)","v":"E"},"",""]
[{"$f":"IF(A12=\"\",\"\",A12)","v":"F"},"",""]
[null,null,{"$f":"SUM(C28:C33)","v":0}]
[]
["n:",{"$f":"COUNTA(Parámetros!A18:A23)","v":6}]
["FACTOR:",{"$f":"(1/COUNT(C28:C33))*C34","v":{"$error":"#DIV/0!"}}]
["INDICE DE CONS:",{"$f":"(B37-COUNT(C28:C33))/(COUNT(C28:C33)-1)","v":{"$error":"#DIV/0!"}}]
["IA (nxn):",{"$f":"VLOOKUP(B36,Parámetros!B27:C35,2,0)","v":1.25}]
["CONSISTENCIA:",{"$f":"IF((B39*(VLOOKUP(B36,Parámetros!B27:D35,3,0)))<B38,\"Inconsistencias serias\",\"Grado de consistencia satisfactorio\")","v":{"$error":"#DIV/0!"}}]

{"sheet":"Factor 9","index":10,"n_rows":40,"n_cols":8,"rows_kept":40,"cut":false,"hidden":false,"merged":[]}
[{"$f":"Factores!A13","v":"Factor 9"}]
[]
[]
[]
[]
[null,{"$f":"A7","v":"A"},{"$f":"IF(A8=\"\",\"\",A8)","v":"B"},{"$f":"IF(A9=\"\",\"\",A9)","v":"C"},{"$f":"IF(A10=\"\",\"\",A10)","v":"D"},{"$f":"IF(A11=\"\",\"\",A11)","v":"E"},{"$f":"IF(A12=\"\",\"\",A12)","v":"F"}]
[{"$f":"IF((Parámetros!A18)=\"\",\"\",(Parámetros!A18))","v":"A"},1]
[{"$f":"IF((Parámetros!A19)=\"\",\"\",(Parámetros!A19))","v":"B"},{"$f":"IF($A8=\"\",\"\",(1/C7))","v":{"$error":"#DIV/0!"}},1]
[{"$f":"IF((Parámetros!A20)=\"\",\"\",(Parámetros!A20))","v":"C"},{"$f":"IF($A9=\"\",\"\",(1/D7))","v":{"$error":"#DIV/0!"}},{"$f":"IF($A9=\"\",\"\",(1/D8))","v":{"$error":"#DIV/0!"}},1]
[{"$f":"IF((Parámetros!A21)=\"\",\"\",(Parámetros!A21))","v":"D"},{"$f":"IF($A10=\"\",\"\",(1/E7))","v":{"$error":"#DIV/0!"}},{"$f":"IF($A10=\"\",\"\",(1/E8))","v":{"$error":"#DIV/0!"}},{"$f":"IF($A10=\"\",\"\",(1/E9))","v":{"$error":"#DIV/0!"}},1]
[{"$f":"IF((Parámetros!A22)=\"\",\"\",(Parámetros!A22))","v":"E"},{"$f":"IF($A11=\"\",\"\",(1/F7))","v":{"$error":"#DIV/0!"}},{"$f":"IF($A11=\"\",\"\",(1/F8))","v":{"$error":"#DIV/0!"}},{"$f":"IF($A11=\"\",\"\",(1/F9))","v":{"$error":"#DIV/0!"}},{"$f":"IF($A11=\"\",\"\",(1/F10))","v":{"$error":"#DIV/0!"}},1]
[{"$f":"IF((Parámetros!A23)=\"\",\"\",(Parámetros!A23))","v":"F"},{"$f":"IF($A12=\"\",\"\",(1/G7))","v":{"$error":"#DIV/0!"}},{"$f":"IF($A12=\"\",\"\",(1/G8))","v":{"$error":"#DIV/0!"}},{"$f":"IF($A12=\"\",\"\",(1/G9))","v":{"$error":"#DIV/0!"}},{"$f":"IF($A12=\"\",\"\",(1/G10))","v":{"$error":"#DIV/0!"}},{"$f":"IF($A12=\"\",\"\",(1/G11))","v":{"$error":"#DIV/0!"}},1]
[null,{"$f":"SUM(B7:B12)","v":{"$error":"#DIV/0!"}},{"$error":"#DIV/0!"},{"$error":"#DIV/0!"},{"$error":"#DIV/0!"},{"$error":"#DIV/0!"},1]
[]
[]
[null,{"$f":"B6","v":"A"},"B","C","D","E","F"]
[{"$f":"A7","v":"A"},{"$f":"IFERROR((B7/B$13),\"\")","v":""},{"$f":"IFERROR((C7/C$13),\"\")","v":""},"","","",0,{"$f":"IFERROR((IF((AVERAGEIF(B17:G17,\">0\"))=1,0,(AVERAGEIF(B17:G17,\">0\")))),0)","v":0}]
[{"$f":"IF(A8=\"\",\"\",A8)","v":"B"},{"$f":"IFERROR((B8/B$13),\"\")","v":""},"","","","",0,{"$f":"IFERROR((IF((AVERAGEIF(B18:G18,\">0\"))=1,0,(AVERAGEIF(B18:G18,\">0\")))),0)","v":0}]
[{"$f":"IF(A9=\"\",\"\",A9)","v":"C"},"","","","","",0,0]
[{"$f":"IF(A10=\"\",\"\",A10)","v":"D"},"","","","","",0,0]
[{"$f":"IF(A11=\"\",\"\",A11)","v":"E"},"","","","","",0,0]
[{"$f":"IF(A12=\"\",\"\",A12)","v":"F"},"","","","","",1,0]
[null,{"$f":"SUM(B17:B22)","v":0},0,0,0,0,1]
[]
[]
["Prueba de consistencia"]
[]
[{"$f":"A17","v":"A"},{"$f":"IFERROR(((B7*$H$17)+(C7*$H$18)+(D7*$H$19)+(E7*$H$20)+(F7*$H$21)+(G7*$H$22)),\"\")","v":0},{"$f":"IFERROR((B28/H17),\"\")","v":""}]
[{"$f":"IF(A8=\"\",\"\",A8)","v":"B"},{"$f":"IFERROR(((B8*$H$17)+(C8*$H$18)+(D8*$H$19)+(E8*$H$20)+(F8*$H$21)+(G8*$H$22)),\"\")","v":""},""]
[{"$f":"IF(A9=\"\",\"\",A9)","v":"C"},"",""]
[{"$f":"IF(A10=\"\",\"\",A10)","v":"D"},"",""]
[{"$f":"IF(A11=\"\",\"\",A11)","v":"E"},"",""]
[{"$f":"IF(A12=\"\",\"\",A12)","v":"F"},"",""]
[null,null,{"$f":"SUM(C28:C33)","v":0}]
[]
["n:",{"$f":"COUNTA(Parámetros!A18:A23)","v":6}]
["FACTOR:",{"$f":"(1/COUNT(C28:C33))*C34","v":{"$error":"#DIV/0!"}}]
["INDICE DE CONS:",{"$f":"(B37-COUNT(C28:C33))/(COUNT(C28:C33)-1)","v":{"$error":"#DIV/0!"}}]
["IA (nxn):",{"$f":"VLOOKUP(B36,Parámetros!B27:C35,2,0)","v":1.25}]
["CONSISTENCIA:",{"$f":"IF((B39*(VLOOKUP(B36,Parámetros!B27:D35,3,0)))<B38,\"Inconsistencias serias\",\"Grado de consistencia satisfactorio\")","v":{"$error":"#DIV/0!"}}]

{"sheet":"Resultados","index":11,"n_rows":9,"n_cols":2,"rows_kept":9,"cut":false,"hidden":false,"merged":[]}
["Parámetros para el Proceso de Jerarquización Analítica"]
["Creado por: Prof. Marco Arias Vargas (marco.ariasvargas@ucr.ac.cr)"]
[]
[{"$f":"'Factor 9'!A7","v":"A"},{"$f":"IF(A4=\"\",\"\",(IFERROR((('Factor 1'!H17*Factores!$K$20)+('Factor 2'!H17*Factores!$K$21)+('Factor 3'!H17*Factores!$K$22)+('Factor 4'!H17*Factores!$K$23)+('Factor 5'!H17*Factores!$K$24)+('Factor 6'!H17*Factores!$K$25)+('Factor 7'!H17*Factores!$K$26)+('Factor 8'!H17*Factores!$K$27)+('Factor 9'!H17*Factores!$K$28)),0)))","v":0}]
[{"$f":"'Factor 9'!A8","v":"B"},{"$f":"IF(A5=\"\",\"\",(IFERROR((('Factor 1'!H18*Factores!$K$20)+('Factor 2'!H18*Factores!$K$21)+('Factor 3'!H18*Factores!$K$22)+('Factor 4'!H18*Factores!$K$23)+('Factor 5'!H18*Factores!$K$24)+('Factor 6'!H18*Factores!$K$25)+('Factor 7'!H18*Factores!$K$26)+('Factor 8'!H18*Factores!$K$27)+('Factor 9'!H18*Factores!$K$28)),0)))","v":0}]
[{"$f":"'Factor 9'!A9","v":"C"},{"$f":"IF(A6=\"\",\"\",(IFERROR((('Factor 1'!H19*Factores!$K$20)+('Factor 2'!H19*Factores!$K$21)+('Factor 3'!H19*Factores!$K$22)+('Factor 4'!H19*Factores!$K$23)+('Factor 5'!H19*Factores!$K$24)+('Factor 6'!H19*Factores!$K$25)+('Factor 7'!H19*Factores!$K$26)+('Factor 8'!H19*Factores!$K$27)+('Factor 9'!H19*Factores!$K$28)),0)))","v":0}]
[{"$f":"'Factor 9'!A10","v":"D"},{"$f":"IF(A7=\"\",\"\",(IFERROR((('Factor 1'!H20*Factores!$K$20)+('Factor 2'!H20*Factores!$K$21)+('Factor 3'!H20*Factores!$K$22)+('Factor 4'!H20*Factores!$K$23)+('Factor 5'!H20*Factores!$K$24)+('Factor 6'!H20*Factores!$K$25)+('Factor 7'!H20*Factores!$K$26)+('Factor 8'!H20*Factores!$K$27)+('Factor 9'!H20*Factores!$K$28)),0)))","v":0}]
[{"$f":"'Factor 9'!A11","v":"E"},{"$f":"IF(A8=\"\",\"\",(IFERROR((('Factor 1'!H21*Factores!$K$20)+('Factor 2'!H21*Factores!$K$21)+('Factor 3'!H21*Factores!$K$22)+('Factor 4'!H21*Factores!$K$23)+('Factor 5'!H21*Factores!$K$24)+('Factor 6'!H21*Factores!$K$25)+('Factor 7'!H21*Factores!$K$26)+('Factor 8'!H21*Factores!$K$27)+('Factor 9'!H21*Factores!$K$28)),0)))","v":0}]
[{"$f":"'Factor 9'!A12","v":"F"},{"$f":"IF(A9=\"\",\"\",(IFERROR((('Factor 1'!H22*Factores!$K$20)+('Factor 2'!H22*Factores!$K$21)+('Factor 3'!H22*Factores!$K$22)+('Factor 4'!H22*Factores!$K$23)+('Factor 5'!H22*Factores!$K$24)+('Factor 6'!H22*Factores!$K$25)+('Factor 7'!H22*Factores!$K$26)+('Factor 8'!H22*Factores!$K$27)+('Factor 9'!H22*Factores!$K$28)),0)))","v":0}]